As we transition to the new Hyland Community, some post links may be temporarily disrupted as we finalize redirects. We apologize for the inconvenience and are working to resolve this as quickly as possible. Details.
aopalliance-1.0.jarasm-commons-3.2.jarcglib-2.2.jarcommons-codec-1.2.jardoxia-modules-apt.1.1.2.jarmaven-common-artifacts-filters-1.3.jarmaven-surefire-common-2.7.1.jarplexus-utils-2.0.5.jarspring-jdbc-3.0.3.RELEASE.jarspring-orm-3.0.3.RELEASE.jarsurefire-api-2.7.1.jarsurefire-booter-2.7.1.jar
[exec] ——————————————————- [exec] T E S T S [exec] ——————————————————- [exec] Running org.activiti.spring.test.expression.SpringLimitedExpressionsTest [exec] Tests run: 1, Failures: 0, Errors: 0, Skipped: 0, Time elapsed: 3.719 sec [exec] Running org.activiti.spring.test.taskassignment.CustomTaskAssignmentTest [exec] Tests run: 3, Failures: 0, Errors: 0, Skipped: 0, Time elapsed: 1.267 sec [exec] Running org.activiti.spring.test.jpa.JPASpringTest [exec] Tests run: 2, Failures: 0, Errors: 2, Skipped: 0, Time elapsed: 0.93 sec <<< FAILURE! [exec] Running org.activiti.spring.test.taskListener.TaskListenerSpringTest [exec] Tests run: 1, Failures: 0, Errors: 0, Skipped: 0, Time elapsed: 0.654 sec [exec] Running org.activiti.spring.test.junit4.SpringJunit4Test [exec] Tests run: 1, Failures: 0, Errors: 0, Skipped: 0, Time elapsed: 0.566 sec [exec] Running org.activiti.spring.test.servicetask.ServiceTaskSpringDelegationTest [exec] Tests run: 3, Failures: 0, Errors: 0, Skipped: 0, Time elapsed: 0.891 sec [exec] Running org.activiti.spring.test.components.scope.ScopingTest [exec] Tests run: 2, Failures: 0, Errors: 2, Skipped: 0, Time elapsed: 0.65 sec <<< FAILURE! [exec] Running org.activiti.spring.test.components.ProcessStartingBeanPostProcessorTest [exec] Tests run: 4, Failures: 0, Errors: 4, Skipped: 0, Time elapsed: 1.198 sec <<< FAILURE! [exec] Running org.activiti.spring.test.transaction.SpringTransactionIntegrationTest [exec] Tests run: 2, Failures: 0, Errors: 2, Skipped: 0, Time elapsed: 0.524 sec <<< FAILURE! [exec] Running org.activiti.spring.test.autodeployment.SpringAutoDeployTest [exec] Tests run: 4, Failures: 0, Errors: 0, Skipped: 0, Time elapsed: 2.095 sec [exec] [exec] Results : [exec] [exec] Tests in error: [exec] testJpaVariableHappyPath(org.activiti.spring.test.jpa.JPASpringTest) [exec] testJpaVariableDisapprovalPath(org.activiti.spring.test.jpa.JPASpringTest) [exec] testUsingAnInjectedScopedProxy(org.activiti.spring.test.components.scope.ScopingTest) [exec] testStartingAProcessWithScopedBeans(org.activiti.spring.test.components.scope.ScopingTest) [exec] testReturnedProcessInstance(org.activiti.spring.test.components.ProcessStartingBeanPostProcessorTest) [exec] testReflectingSideEffects(org.activiti.spring.test.components.ProcessStartingBeanPostProcessorTest) [exec] testUsingBusinessKey(org.activiti.spring.test.components.ProcessStartingBeanPostProcessorTest) [exec] testLaunchingProcessInstance(org.activiti.spring.test.components.ProcessStartingBeanPostProcessorTest) [exec] testBasicActivitiSpringIntegration(org.activiti.spring.test.transaction.SpringTransactionIntegrationTest) [exec] testRollbackTransactionOnActivitiException(org.activiti.spring.test.transaction.SpringTransactionIntegrationTest)
Hi,I`ve tried it with the actual sources again - without having problems. Have you installed maven? What happens if you type "mvn" at your shell?Best regardsMichael
Downloading: http://repository.jboss.org/nexus/content/groups/public/org/activiti/activiti-spring/5.9-SNAPSHOT/activiti-spring-5.9-SNAPSHOT.jar[INFO] Unable to find resource 'org.activiti:activiti-spring:jar:5.9-SNAPSHOT' in repository jboss (http://repository.jboss.org/nexus/content/groups/public)Downloading: http://maven.restlet.org/org/activiti/activiti-spring/5.9-SNAPSHOT/activiti-spring-5.9-SNAPSHOT.jar[INFO] Unable to find resource 'org.activiti:activiti-spring:jar:5.9-SNAPSHOT' in repository maven-restlet (http://maven.restlet.org)Downloading: http://maven.vaadin.com/vaadin-addons/org/activiti/activiti-spring/5.9-SNAPSHOT/activiti-spring-5.9-SNAPSHOT.jar[INFO] Unable to find resource 'org.activiti:activiti-spring:jar:5.9-SNAPSHOT' in repository vaadin-addons (http://maven.vaadin.com/vaadin-addons)