As we transition to the new Hyland Community, some post links may be temporarily disrupted as we finalize redirects. We apologize for the inconvenience and are working to resolve this as quickly as possible. Details.
C:\activiti-5.0.rc1\setup>ant demo.setup Buildfile: C:\activiti-5.0.rc1\setup\build.xml maven.download: maven.install: internal.install.activiti.libs: [exec] [INFO] Scanning for projects… [exec] [INFO] Searching repository for plugin with prefix: 'install'. [exec] [INFO] ————————————————————- ———– [exec] [INFO] Building Maven Default Project [exec] [INFO] task-segment: [install:install-file] (aggregator-style) [exec] [INFO] ————————————————————- ———– [exec] [INFO] [install:install-file {execution: default-cli}] [exec] [INFO] Installing C:\activiti-5.0.rc1\lib\activiti-engine-5.0.rc1.ja r to C:\products\repository\org\activiti\activiti-engine\5.0.rc1\activiti-engine -5.0.rc1.jar [exec] [INFO] ————————————————————- ———– [exec] [INFO] BUILD SUCCESSFUL [exec] [INFO] ————————————————————- ———– [exec] [INFO] Total time: < 1 second [exec] [INFO] Finished at: Tue Nov 30 16:40:10 EST 2010 [exec] [INFO] Final Memory: 3M/15M [exec] [INFO] ————————————————————- ———– [exec] [INFO] Scanning for projects… [exec] [INFO] Searching repository for plugin with prefix: 'install'. [exec] [INFO] ————————————————————- ———– [exec] [INFO] Building Maven Default Project [exec] [INFO] task-segment: [install:install-file] (aggregator-style) [exec] [INFO] ————————————————————- ———– [exec] [INFO] [install:install-file {execution: default-cli}] [exec] [INFO] Installing C:\activiti-5.0.rc1\lib\activiti-spring-5.0.rc1.ja r to C:\products\repository\org\activiti\activiti-spring\5.0.rc1\activiti-spring -5.0.rc1.jar [exec] [INFO] ————————————————————- ———– [exec] [INFO] BUILD SUCCESSFUL [exec] [INFO] ————————————————————- ———– [exec] [INFO] Total time: < 1 second [exec] [INFO] Finished at: Tue Nov 30 16:40:12 EST 2010 [exec] [INFO] Final Memory: 3M/15M [exec] [INFO] ————————————————————- ———– examples.get.libs.engine: examples.get.libs.spring: examples.get.libs.all: db.get.libs: h2.install: internal.classpath.libs: internal.taskdef.launch: BUILD FAILED C:\activiti-5.0.rc1\setup\build.xml:477: taskdef class org.activiti.engine.impl. ant.LaunchTask cannot be found using the classloader AntClassLoader[C:\activiti-5.0.rc1\examples\activiti-engi ne-examples\libs-runtime\activation-1.1.jar;C:\activiti-5.0.rc1\examples\activit i-engine-examples\libs-runtime\commons-email-1.2.jar;C:\activiti-5.0.rc1\example s\activiti-engine-examples\libs-runtime\groovy-all-1.7.2.jar;C:\activiti-5.0.rc1 \examples\activiti-engine-examples\libs-runtime\jaxb-api-2.1.jar;C:\activiti-5.0 .rc1\examples\activiti-engine-examples\libs-runtime\jaxb-impl-2.1.7.jar;C:\activ iti-5.0.rc1\examples\activiti-engine-examples\libs-runtime\jaxb-xjc-2.1.7.jar;C: \activiti-5.0.rc1\examples\activiti-engine-examples\libs-runtime\livetribe-jsr22 3-2.0.6.jar;C:\activiti-5.0.rc1\examples\activiti-engine-examples\libs-runtime\m ail-1.4.1.jar;C:\activiti-5.0.rc1\examples\activiti-engine-examples\libs-runtime \mybatis-3.0.1.jar;C:\activiti-5.0.rc1\examples\activiti-engine-examples\libs-ru ntime\stax-api-1.0-2.jar;C:\activiti-5.0.rc1\examples\activiti-engine-examples\l ibs-runtime\wsdl4j-1.6.2.jar;C:\activiti-5.0.rc1\examples\activiti-engine-exampl es\libs-runtime\xercesImpl-2.9.1.jar;C:\activiti-5.0.rc1\examples\activiti-engin e-examples\libs-runtime\xml-apis-1.3.04.jar;C:\activiti-5.0.rc1\lib\activiti-cyc le-5.0.rc1.jar] Total time: 3 seconds C:\activiti-5.0.rc1\setup>
<target name="internal.classpath.libs" depends="examples.get.libs.engine"><br> <path id="classpath.libs"><br> <fileset dir="${activiti.home}/examples/activiti-engine-examples/libs-runtime"><br> <include name="*.jar" /><br> </fileset><br> <fileset dir="${activiti.home}/examples/activiti-engine-examples/libs-test"><br> <include name="*.jar" /><br> </fileset><br> <!–TODO: not really sure if this a good solution. Maybe create an own target for the activiti.cycle classpath–> <br> <!–added for testing–><br> <fileset dir="${activiti.home}/lib"><br> <!–include name="activiti-cycle-${activiti.version}.jar" /–><br> <include name="*.jar"/><br> </fileset><br> </path><br> </target><br>
BUILD FAILED<br>C:\activiti-5.0.rc1\setup\build.xml:360: taskdef class org.activiti.engine.impl.<br>ant.DeployBarTask cannot be found<br> using the classloader AntClassLoader[C:\activiti-5.0.rc1\setup\files\demo;C:\ac<br>tiviti-5.0.rc1\setup\build\activiti-cfg.jar;C:\activiti-5.0.rc1\examples\activit<br>i-engine-examples\libs-runtime\activation-1.1.jar;C:\activiti-5.0.rc1\examples\a<br>ctiviti-engine-examples\libs-runtime\commons-email-1.2.jar;C:\activiti-5.0.rc1\e<br>xamples\activiti-engine-examples\libs-runtime\groovy-all-1.7.2.jar;C:\activiti-5<br>.0.rc1\examples\activiti-engine-examples\libs-runtime\jaxb-api-2.1.jar;C:\activi<br>ti-5.0.rc1\examples\activiti-engine-examples\libs-runtime\jaxb-impl-2.1.7.jar;C:<br>\activiti-5.0.rc1\examples\activiti-engine-examples\libs-runtime\jaxb-xjc-2.1.7.<br>jar;C:\activiti-5.0.rc1\examples\activiti-engine-examples\libs-runtime\livetribe<br>-jsr223-2.0.6.jar;C:\activiti-5.0.rc1\examples\activiti-engine-examples\libs-run<br>time\mail-1.4.1.jar;C:\activiti-5.0.rc1\examples\activiti-engine-examples\libs-r<br>untime\mybatis-3.0.1.jar;C:\activiti-5.0.rc1\examples\activiti-engine-examples\l<br>ibs-runtime\stax-api-1.0-2.jar;C:\activiti-5.0.rc1\examples\activiti-engine-exam<br>ples\libs-runtime\wsdl4j-1.6.2.jar;C:\activiti-5.0.rc1\examples\activiti-engine-<br>examples\libs-runtime\xercesImpl-2.9.1.jar;C:\activiti-5.0.rc1\examples\activiti<br>-engine-examples\libs-runtime\xml-apis-1.3.04.jar]
<taskdef name="deploy-bar" classname="org.activiti.engine.impl.ant.DeployBarTask"><br> <classpath><br> <pathelement path="files/demo"/><br> <fileset dir="build"><br> <include name="activiti-cfg.jar"/><br> </fileset><br> <fileset dir="${activiti.home}/examples/activiti-engine-examples/libs-runtime" /><br> <fileset dir="${activiti.home}/examples/activiti-engine-examples/libs-test" /><br> <fileset dir="${activiti.home}/lib"><br> <include name="*.jar"/><br> </fileset><br> </classpath><br> </taskdef>
SEVERE: Context initialization failed<br>org.springframework.beans.factory.BeanCreationException: Error creating bean wit<br>h name 'webscript.org.activiti.rest.api.identity.user-groups.get' defined in Ser<br>vletContext resource [/WEB-INF/web-application-context.xml]: Instantiation of be<br>an failed; nested exception is java.lang.NoClassDefFoundError: org/activiti/engi<br>ne/query/Query<br> at org.springframework.beans.factory.support.AbstractAutowireCapableBean<br>Factory.instantiateBean(AbstractAutowireCapableBeanFactory.java:946)<br> at org.springframework.beans.factory.support.AbstractAutowireCapableBean<br>Factory.createBeanInstance(AbstractAutowireCapableBeanFactory.java:890)<br> at org.springframework.beans.factory.support.AbstractAutowireCapableBean<br>Factory.doCreateBean(AbstractAutowireCapableBeanFactory.java:479)<br> at org.springframework.beans.factory.support.AbstractAutowireCapableBean<br>Factory.createBean(AbstractAutowireCapableBeanFactory.java:450)<br> at org.springframework.beans.factory.support.AbstractBeanFactory$1.getOb<br>ject(AbstractBeanFactory.java:290)<br> at org.springframework.beans.factory.support.DefaultSingletonBeanRegistr<br>y.getSingleton(DefaultSingletonBeanRegistry.java:222)<br> at org.springframework.beans.factory.support.AbstractBeanFactory.doGetBe<br>an(AbstractBeanFactory.java:287)<br> at org.springframework.beans.factory.support.AbstractBeanFactory.getBean<br>(AbstractBeanFactory.java:189)<br> at org.springframework.beans.factory.support.DefaultListableBeanFactory.<br>preInstantiateSingletons(DefaultListableBeanFactory.java:557)<br> at org.springframework.context.support.AbstractApplicationContext.finish<br>BeanFactoryInitialization(AbstractApplicationContext.java:842)<br> at org.springframework.context.support.AbstractApplicationContext.refres<br>h(AbstractApplicationContext.java:416)<br> at org.springframework.web.context.ContextLoader.createWebApplicationCon<br>text(ContextLoader.java:261)<br> at org.springframework.web.context.ContextLoader.initWebApplicationConte
30/11/2010 9:30:14 PM org.springframework.extensions.webscripts.AbstractRuntimeexecuteScriptSEVERE: Exception from executeScript - redirecting to status template error: 10300000 Wrapped Exception (with status template): nullorg.springframework.extensions.webscripts.WebScriptException: 10300000 Wrapped Exception (with status template): null at org.springframework.extensions.webscripts.AbstractWebScript.createStatusException(AbstractWebScript.java:742) at org.springframework.extensions.webscripts.DeclarativeWebScript.execute(DeclarativeWebScript.java:167) at org.springframework.extensions.webscripts.PresentationContainer.executeScript(PresentationContainer.java:69) at org.springframework.extensions.webscripts.AbstractRuntime.executeScript(AbstractRuntime.java:333) at org.springframework.extensions.webscripts.AbstractRuntime.executeScript(AbstractRuntime.java:189) at org.springframework.extensions.webscripts.servlet.WebScriptServlet.service(WebScriptServlet.java:118) at javax.servlet.http.HttpServlet.service(HttpServlet.java:717) at org.apache.catalina.core.ApplicationFilterChain.internalDoFilter(ApplicationFilterChain.java:290) at org.apache.catalina.core.ApplicationFilterChain.doFilter(ApplicationFilterChain.java:206) at org.apache.catalina.core.StandardWrapperValve.invoke(StandardWrapperValve.java:233) at org.apache.catalina.core.StandardContextValve.invoke(StandardContextValve.java:191) at org.apache.catalina.core.StandardHostValve.invoke(StandardHostValve.java:127) at org.apache.catalina.valves.ErrorReportValve.invoke(ErrorReportValve.java:102) at org.apache.catalina.core.StandardEngineValve.invoke(StandardEngineValve.java:109) at org.apache.catalina.connector.CoyoteAdapter.service(CoyoteAdapter.java:298) at org.apache.coyote.http11.Http11Processor.process(Http11Processor.java:857) at org.apache.coyote.http11.Http11Protocol$Http11ConnectionHandler.process(Http11Protocol.java:588) at org.apache.tomcat.util.net.JIoEndpoint$Worker.run(JIoEndpoint.java:489) at java.lang.Thread.run(Thread.java:619)Caused by: java.lang.NullPointerException at org.activiti.rest.util.ActivitiWebScript.getIdentityService(ActivitiWebScript.java:127) at org.activiti.rest.util.ActivitiWebScript.executeImpl(ActivitiWebScript.java:83) at org.springframework.extensions.webscripts.DeclarativeWebScript.execute(DeclarativeWebScript.java:64) … 17 more30/11/2010 9:30:15 PM org.springframework.extensions.webscripts.connector.AuthenticatingConnector handshakeSEVERE: An exception occurred while attempting authentication handshake for endpoint: http://localhost:8080/activiti-rest/serviceorg.springframework.extensions.surf.exception.AuthenticationException: 10300000Wrapped Exception (with status template): null at org.activiti.surf.ActivitiRESTAuthenticator.authenticate(ActivitiRESTAuthenticator.java:97) at org.springframework.extensions.webscripts.connector.AuthenticatingConnector.handshake(AuthenticatingConnector.java:403) at org.activiti.surf.ActivitiUserFactory.authenticate(ActivitiUserFactory.java:137) at org.springframework.extensions.surf.mvc.LoginController.handleRequestInternal(LoginController.java:67) at org.springframework.web.servlet.mvc.AbstractController.handleRequest(AbstractController.java:153) at org.springframework.web.servlet.mvc.SimpleControllerHandlerAdapter.handle(SimpleControllerHandlerAdapter.java:48) at org.springframework.web.servlet.DispatcherServlet.doDispatch(DispatcherServlet.java:771) at org.springframework.web.servlet.DispatcherServlet.doService(DispatcherServlet.java:716) at org.springframework.web.servlet.FrameworkServlet.processRequest(FrameworkServlet.java:647) at org.springframework.web.servlet.FrameworkServlet.doPost(FrameworkServlet.java:563) at javax.servlet.http.HttpServlet.service(HttpServlet.java:637) at javax.servlet.http.HttpServlet.service(HttpServlet.java:717) at org.apache.catalina.core.ApplicationFilterChain.internalDoFilter(ApplicationFilterChain.java:290) at org.apache.catalina.core.ApplicationFilterChain.doFilter(ApplicationFilterChain.java:206) at org.apache.catalina.core.ApplicationDispatcher.invoke(ApplicationDispatcher.java:646) at org.apache.catalina.core.ApplicationDispatcher.processRequest(ApplicationDispatcher.java:436) at org.apache.catalina.core.ApplicationDispatcher.doForward(ApplicationDispatcher.java:374) at org.apache.catalina.core.ApplicationDispatcher.forward(ApplicationDispatcher.java:302) at org.tuckey.web.filters.urlrewrite.NormalRewrittenUrl.doRewrite(NormalRewrittenUrl.java:195) at org.tuckey.web.filters.urlrewrite.RuleChain.handleRewrite(RuleChain.java:159) at org.tuckey.web.filters.urlrewrite.RuleChain.doRules(RuleChain.java:141) at org.tuckey.web.filters.urlrewrite.UrlRewriter.processRequest(UrlRewriter.java:90) at org.tuckey.web.filters.urlrewrite.UrlRewriteFilter.doFilter(UrlRewriteFilter.java:417) at org.apache.catalina.core.ApplicationFilterChain.internalDoFilter(ApplicationFilterChain.java:235) at org.apache.catalina.core.ApplicationFilterChain.doFilter(ApplicationFilterChain.java:206) at org.apache.catalina.core.StandardWrapperValve.invoke(StandardWrapperValve.java:233) at org.apache.catalina.core.StandardContextValve.invoke(StandardContextValve.java:191) at org.apache.catalina.core.StandardHostValve.invoke(StandardHostValve.java:127) at org.apache.catalina.valves.ErrorReportValve.invoke(ErrorReportValve.java:102) at org.apache.catalina.core.StandardEngineValve.invoke(StandardEngineValve.java:109) at org.apache.catalina.connector.CoyoteAdapter.service(CoyoteAdapter.java:298) at org.apache.coyote.http11.Http11Processor.process(Http11Processor.java:857) at org.apache.coyote.http11.Http11Protocol$Http11ConnectionHandler.process(Http11Protocol.java:588) at org.apache.tomcat.util.net.JIoEndpoint$Worker.run(JIoEndpoint.java:489) at java.lang.Thread.run(Thread.java:619)30/11/2010 9:30:23 PM org.apache.catalina.startup.HostConfig deployWARINFO: Deploying web application archive activiti-modeler.war30/11/2010 9:31:00 PM org.springframework.extensions.webscripts.AbstractRuntimeexecuteScriptSEVERE: Exception from executeScript - redirecting to status template error: 10300001 Wrapped Exception (with status template): nullorg.springframework.extensions.webscripts.WebScriptException: 10300001 Wrapped Exception (with status template): null at org.springframework.extensions.webscripts.AbstractWebScript.createStatusException(AbstractWebScript.java:742) at org.springframework.extensions.webscripts.DeclarativeWebScript.execute(DeclarativeWebScript.java:167) at org.springframework.extensions.webscripts.PresentationContainer.executeScript(PresentationContainer.java:69) at org.springframework.extensions.webscripts.AbstractRuntime.executeScript(AbstractRuntime.java:333) at org.springframework.extensions.webscripts.AbstractRuntime.executeScript(AbstractRuntime.java:189) at org.springframework.extensions.webscripts.servlet.WebScriptServlet.service(WebScriptServlet.java:118) at javax.servlet.http.HttpServlet.service(HttpServlet.java:717) at org.apache.catalina.core.ApplicationFilterChain.internalDoFilter(ApplicationFilterChain.java:290) at org.apache.catalina.core.ApplicationFilterChain.doFilter(ApplicationFilterChain.java:206) at org.apache.catalina.core.StandardWrapperValve.invoke(StandardWrapperValve.java:233) at org.apache.catalina.core.StandardContextValve.invoke(StandardContextValve.java:191) at org.apache.catalina.core.StandardHostValve.invoke(StandardHostValve.java:127) at org.apache.catalina.valves.ErrorReportValve.invoke(ErrorReportValve.java:102) at org.apache.catalina.core.StandardEngineValve.invoke(StandardEngineValve.java:109) at org.apache.catalina.connector.CoyoteAdapter.service(CoyoteAdapter.java:298) at org.apache.coyote.http11.Http11Processor.process(Http11Processor.java:857) at org.apache.coyote.http11.Http11Protocol$Http11ConnectionHandler.process(Http11Protocol.java:588) at org.apache.tomcat.util.net.JIoEndpoint$Worker.run(JIoEndpoint.java:489) at java.lang.Thread.run(Thread.java:619)Caused by: java.lang.NullPointerException at org.activiti.rest.util.ActivitiWebScript.getIdentityService(ActivitiWebScript.java:127) at org.activiti.rest.util.ActivitiWebScript.executeImpl(ActivitiWebScript.java:83) at org.springframework.extensions.webscripts.DeclarativeWebScript.execute(DeclarativeWebScript.java:64) … 17 more30/11/2010 9:31:00 PM org.springframework.extensions.webscripts.connector.AuthenticatingConnector handshakeSEVERE: An exception occurred while attempting authentication handshake for endpoint: http://localhost:8080/activiti-rest/serviceorg.springframework.extensions.surf.exception.AuthenticationException: 10300001Wrapped Exception (with status template): null at org.activiti.surf.ActivitiRESTAuthenticator.authenticate(ActivitiRESTAuthenticator.java:97) at org.springframework.extensions.webscripts.connector.AuthenticatingConnector.handshake(AuthenticatingConnector.java:403) at org.activiti.surf.ActivitiUserFactory.authenticate(ActivitiUserFactory.java:137) at org.springframework.extensions.surf.mvc.LoginController.handleRequestInternal(LoginController.java:67) at org.springframework.web.servlet.mvc.AbstractController.handleRequest(AbstractController.java:153) at org.springframework.web.servlet.mvc.SimpleControllerHandlerAdapter.handle(SimpleControllerHandlerAdapter.java:48) at org.springframework.web.servlet.DispatcherServlet.doDispatch(DispatcherServlet.java:771) at org.springframework.web.servlet.DispatcherServlet.doService(DispatcherServlet.java:716) at org.springframework.web.servlet.FrameworkServlet.processRequest(FrameworkServlet.java:647) at org.springframework.web.servlet.FrameworkServlet.doPost(FrameworkServlet.java:563) at javax.servlet.http.HttpServlet.service(HttpServlet.java:637) at javax.servlet.http.HttpServlet.service(HttpServlet.java:717) at org.apache.catalina.core.ApplicationFilterChain.internalDoFilter(ApplicationFilterChain.java:290) at org.apache.catalina.core.ApplicationFilterChain.doFilter(ApplicationFilterChain.java:206) at org.apache.catalina.core.ApplicationDispatcher.invoke(ApplicationDispatcher.java:646) at org.apache.catalina.core.ApplicationDispatcher.processRequest(ApplicationDispatcher.java:436) at org.apache.catalina.core.ApplicationDispatcher.doForward(ApplicationDispatcher.java:374) at org.apache.catalina.core.ApplicationDispatcher.forward(ApplicationDispatcher.java:302) at org.tuckey.web.filters.urlrewrite.NormalRewrittenUrl.doRewrite(NormalRewrittenUrl.java:195) at org.tuckey.web.filters.urlrewrite.RuleChain.handleRewrite(RuleChain.java:159) at org.tuckey.web.filters.urlrewrite.RuleChain.doRules(RuleChain.java:141) at org.tuckey.web.filters.urlrewrite.UrlRewriter.processRequest(UrlRewriter.java:90) at org.tuckey.web.filters.urlrewrite.UrlRewriteFilter.doFilter(UrlRewriteFilter.java:417) at org.apache.catalina.core.ApplicationFilterChain.internalDoFilter(ApplicationFilterChain.java:235) at org.apache.catalina.core.ApplicationFilterChain.doFilter(ApplicationFilterChain.java:206) at org.apache.catalina.core.StandardWrapperValve.invoke(StandardWrapperValve.java:233) at org.apache.catalina.core.StandardContextValve.invoke(StandardContextValve.java:191) at org.apache.catalina.core.StandardHostValve.invoke(StandardHostValve.java:127) at org.apache.catalina.valves.ErrorReportValve.invoke(ErrorReportValve.java:102) at org.apache.catalina.core.StandardEngineValve.invoke(StandardEngineValve.java:109) at org.apache.catalina.connector.CoyoteAdapter.service(CoyoteAdapter.java:298) at org.apache.coyote.http11.Http11Processor.process(Http11Processor.java:857) at org.apache.coyote.http11.Http11Protocol$Http11ConnectionHandler.process(Http11Protocol.java:588) at org.apache.tomcat.util.net.JIoEndpoint$Worker.run(JIoEndpoint.java:489) at java.lang.Thread.run(Thread.java:619)ROOT: C:/activiti-5.0.rc1/apps/activiti-model-repository[INFO] Initializing Root Directory…[INFO] Initialized Root Directory!