As we transition to the new Hyland Community, some post links may be temporarily disrupted as we finalize redirects. We apologize for the inconvenience and are working to resolve this as quickly as possible. Details.
JavaException:org.alfresco.repo.search09020036
Echec de la recherche en raison d'une erreur système:09020059
08200002 Wrapped Exception (with status template): 08200005 Failed to execute script 'classpath*:alfresco/templates/webscripts/org/alfresco/collaboration/tagQuery.get.js': 08200004 Failed to execute search: PATH:"/app:company_home//*" AND ASPECT:"{http://www.alfresco.org/model/content/1.0}taggable" org.springframework.extensions.webscripts.WebScriptException: 08200002 Wrapped Exception (with status template): 08200005 Failed to execute script 'classpath*:alfresco/templates/webscripts/org/alfresco/collaboration/tagQuery.get.js': 08200004 Failed to execute search: PATH:"/app:company_home//*" AND ASPECT:"{http://www.alfresco.org/model/content/1.0}taggable" at org.springframework.extensions.webscripts.AbstractWebScript.createStatusException(AbstractWebScript.java:970) at org.springframework.extensions.webscripts.DeclarativeWebScript.execute(DeclarativeWebScript.java:171) at org.alfresco.repo.web.scripts.RepositoryContainer$2.execute(RepositoryContainer.java:400) at org.alfresco.repo.transaction.RetryingTransactionHelper.doInTransaction(RetryingTransactionHelper.java:388) at org.alfresco.repo.web.scripts.RepositoryContainer.transactionedExecute(RepositoryContainer.java:462) at org.alfresco.repo.web.scripts.RepositoryContainer.transactionedExecuteAs(RepositoryContainer.java:500) at org.alfresco.repo.web.scripts.RepositoryContainer.executeScript(RepositoryContainer.java:316) at org.springframework.extensions.webscripts.AbstractRuntime.executeScript(AbstractRuntime.java:372) at org.springframework.extensions.webscripts.AbstractRuntime.executeScript(AbstractRuntime.java:209) at org.springframework.extensions.webscripts.servlet.WebScriptServlet.service(WebScriptServlet.java:118) at javax.servlet.http.HttpServlet.service(HttpServlet.java:717) at org.apache.catalina.core.ApplicationFilterChain.internalDoFilter(ApplicationFilterChain.java:290) at org.apache.catalina.core.ApplicationFilterChain.doFilter(ApplicationFilterChain.java:206) at org.alfresco.web.app.servlet.GlobalLocalizationFilter.doFilter(GlobalLocalizationFilter.java:58) at org.apache.catalina.core.ApplicationFilterChain.internalDoFilter(ApplicationFilterChain.java:235) at org.apache.catalina.core.ApplicationFilterChain.doFilter(ApplicationFilterChain.java:206) at org.apache.catalina.core.StandardWrapperValve.invoke(StandardWrapperValve.java:233) at org.apache.catalina.core.StandardContextValve.invoke(StandardContextValve.java:191) at org.apache.catalina.authenticator.AuthenticatorBase.invoke(AuthenticatorBase.java:470) at org.apache.catalina.core.StandardHostValve.invoke(StandardHostValve.java:127) at org.apache.catalina.valves.ErrorReportValve.invoke(ErrorReportValve.java:102) at org.apache.catalina.core.StandardEngineValve.invoke(StandardEngineValve.java:109) at org.apache.catalina.connector.CoyoteAdapter.service(CoyoteAdapter.java:298) at org.apache.coyote.http11.Http11Processor.process(Http11Processor.java:857) at org.apache.coyote.http11.Http11Protocol$Http11ConnectionHandler.process(Http11Protocol.java:588) at org.apache.tomcat.util.net.JIoEndpoint$Worker.run(JIoEndpoint.java:489) at java.lang.Thread.run(Thread.java:662) Caused by: org.alfresco.scripts.ScriptException: 08200005 Failed to execute script 'classpath*:alfresco/templates/webscripts/org/alfresco/collaboration/tagQuery.get.js': 08200004 Failed to execute search: PATH:"/app:company_home//*" AND ASPECT:"{http://www.alfresco.org/model/content/1.0}taggable" at org.alfresco.repo.jscript.RhinoScriptProcessor.execute(RhinoScriptProcessor.java:195) at org.alfresco.repo.processor.ScriptServiceImpl.execute(ScriptServiceImpl.java:212) at org.alfresco.repo.processor.ScriptServiceImpl.executeScript(ScriptServiceImpl.java:174) at org.alfresco.repo.web.scripts.RepositoryScriptProcessor.executeScript(RepositoryScriptProcessor.java:102) at org.springframework.extensions.webscripts.AbstractWebScript.executeScript(AbstractWebScript.java:1193) at org.springframework.extensions.webscripts.DeclarativeWebScript.execute(DeclarativeWebScript.java:86) … 25 more Caused by: org.alfresco.error.AlfrescoRuntimeException: 08200004 Failed to execute search: PATH:"/app:company_home//*" AND ASPECT:"{http://www.alfresco.org/model/content/1.0}taggable" at org.alfresco.repo.jscript.Search.query(Search.java:821) at org.alfresco.repo.jscript.Search.query(Search.java:779) at org.alfresco.repo.jscript.Search.query(Search.java:738) at org.alfresco.repo.jscript.Search.luceneSearch(Search.java:326) at org.alfresco.repo.jscript.Search.luceneSearch(Search.java:311) at sun.reflect.NativeMethodAccessorImpl.invoke0(Native Method) at sun.reflect.NativeMethodAccessorImpl.invoke(NativeMethodAccessorImpl.java:39) at sun.reflect.DelegatingMethodAccessorImpl.invoke(DelegatingMethodAccessorImpl.java:25) at java.lang.reflect.Method.invoke(Method.java:597) at org.mozilla.javascript.MemberBox.invoke(MemberBox.java:155) at org.mozilla.javascript.NativeJavaMethod.call(NativeJavaMethod.java:243) at org.mozilla.javascript.optimizer.OptRuntime.call1(OptRuntime.java:66) at org.mozilla.javascript.gen.c3._c1(file:/opt/alfresco-4.0.d/tomcat/webapps/alfresco/WEB-INF/classes/alfresco/templates/webscripts/org/alfresco/collaboration/tagQuery.get.js:46) at org.mozilla.javascript.gen.c3.call(file:/opt/alfresco-4.0.d/tomcat/webapps/alfresco/WEB-INF/classes/alfresco/templates/webscripts/org/alfresco/collaboration/tagQuery.get.js) at org.mozilla.javascript.optimizer.OptRuntime.callName0(OptRuntime.java:108) at org.mozilla.javascript.gen.c3._c0(file:/opt/alfresco-4.0.d/tomcat/webapps/alfresco/WEB-INF/classes/alfresco/templates/webscripts/org/alfresco/collaboration/tagQuery.get.js:175) at org.mozilla.javascript.gen.c3.call(file:/opt/alfresco-4.0.d/tomcat/webapps/alfresco/WEB-INF/classes/alfresco/templates/webscripts/org/alfresco/collaboration/tagQuery.get.js) at org.mozilla.javascript.ContextFactory.doTopCall(ContextFactory.java:393) at org.mozilla.javascript.ScriptRuntime.doTopCall(ScriptRuntime.java:2834) at org.mozilla.javascript.gen.c3.call(file:/opt/alfresco-4.0.d/tomcat/webapps/alfresco/WEB-INF/classes/alfresco/templates/webscripts/org/alfresco/collaboration/tagQuery.get.js) at org.mozilla.javascript.gen.c3.exec(file:/opt/alfresco-4.0.d/tomcat/webapps/alfresco/WEB-INF/classes/alfresco/templates/webscripts/org/alfresco/collaboration/tagQuery.get.js) at org.alfresco.repo.jscript.RhinoScriptProcessor.executeScriptImpl(RhinoScriptProcessor.java:483) at org.alfresco.repo.jscript.RhinoScriptProcessor.execute(RhinoScriptProcessor.java:191) … 30 more Caused by: org.alfresco.repo.search.impl.lucene.LuceneQueryParserException: 08200003 at org.alfresco.repo.search.impl.solr.SolrQueryHTTPClient.executeQuery(SolrQueryHTTPClient.java:364) at org.alfresco.repo.search.impl.solr.SolrQueryLanguage.executeQuery(SolrQueryLanguage.java:49) at org.alfresco.repo.search.impl.solr.SolrSearchService.query(SolrSearchService.java:348) at org.alfresco.repo.search.SearcherComponent.query(SearcherComponent.java:78) at sun.reflect.NativeMethodAccessorImpl.invoke0(Native Method) at sun.reflect.NativeMethodAccessorImpl.invoke(NativeMethodAccessorImpl.java:39) at sun.reflect.DelegatingMethodAccessorImpl.invoke(DelegatingMethodAccessorImpl.java:25) at java.lang.reflect.Method.invoke(Method.java:597) at org.alfresco.repo.management.subsystems.SubsystemProxyFactory$1.invoke(SubsystemProxyFactory.java:65) at org.springframework.aop.framework.ReflectiveMethodInvocation.proceed(ReflectiveMethodInvocation.java:172) at org.springframework.aop.framework.JdkDynamicAopProxy.invoke(JdkDynamicAopProxy.java:202) at $Proxy13.query(Unknown Source) at sun.reflect.NativeMethodAccessorImpl.invoke0(Native Method) at sun.reflect.NativeMethodAccessorImpl.invoke(NativeMethodAccessorImpl.java:39) at sun.reflect.DelegatingMethodAccessorImpl.invoke(DelegatingMethodAccessorImpl.java:25) at java.lang.reflect.Method.invoke(Method.java:597) at org.springframework.aop.support.AopUtils.invokeJoinpointUsingReflection(AopUtils.java:309) at org.springframework.aop.framework.ReflectiveMethodInvocation.invokeJoinpoint(ReflectiveMethodInvocation.java:183) at org.springframework.aop.framework.ReflectiveMethodInvocation.proceed(ReflectiveMethodInvocation.java:150) at net.sf.acegisecurity.intercept.method.aopalliance.MethodSecurityInterceptor.invoke(MethodSecurityInterceptor.java:80) at org.springframework.aop.framework.ReflectiveMethodInvocation.proceed(ReflectiveMethodInvocation.java:172) at org.alfresco.repo.security.permissions.impl.ExceptionTranslatorMethodInterceptor.invoke(ExceptionTranslatorMethodInterceptor.java:46) at org.springframework.aop.framework.ReflectiveMethodInvocation.proceed(ReflectiveMethodInvocation.java:172) at org.alfresco.repo.audit.AuditMethodInterceptor.invoke(AuditMethodInterceptor.java:147) at org.springframework.aop.framework.ReflectiveMethodInvocation.proceed(ReflectiveMethodInvocation.java:172) at org.springframework.transaction.interceptor.TransactionInterceptor.invoke(TransactionInterceptor.java:110) at org.springframework.aop.framework.ReflectiveMethodInvocation.proceed(ReflectiveMethodInvocation.java:172) at org.springframework.aop.framework.JdkDynamicAopProxy.invoke(JdkDynamicAopProxy.java:202) at $Proxy13.query(Unknown Source) at org.alfresco.repo.jscript.Search.query(Search.java:801) … 52 more Caused by: javax.net.ssl.SSLHandshakeException: sun.security.validator.ValidatorException: PKIX path validation failed: java.security.cert.CertPathValidatorException: timestamp check failed at com.sun.net.ssl.internal.ssl.Alerts.getSSLException(Alerts.java:174) at com.sun.net.ssl.internal.ssl.SSLSocketImpl.fatal(SSLSocketImpl.java:1649) at com.sun.net.ssl.internal.ssl.Handshaker.fatalSE(Handshaker.java:241) at com.sun.net.ssl.internal.ssl.Handshaker.fatalSE(Handshaker.java:235) at com.sun.net.ssl.internal.ssl.ClientHandshaker.serverCertificate(ClientHandshaker.java:1206) at com.sun.net.ssl.internal.ssl.ClientHandshaker.processMessage(ClientHandshaker.java:136) at com.sun.net.ssl.internal.ssl.Handshaker.processLoop(Handshaker.java:593) at com.sun.net.ssl.internal.ssl.Handshaker.process_record(Handshaker.java:529) at com.sun.net.ssl.internal.ssl.SSLSocketImpl.readRecord(SSLSocketImpl.java:893) at com.sun.net.ssl.internal.ssl.SSLSocketImpl.performInitialHandshake(SSLSocketImpl.java:1138) at com.sun.net.ssl.internal.ssl.SSLSocketImpl.writeRecord(SSLSocketImpl.java:632) at com.sun.net.ssl.internal.ssl.AppOutputStream.write(AppOutputStream.java:59) at java.io.BufferedOutputStream.flushBuffer(BufferedOutputStream.java:65) at java.io.BufferedOutputStream.flush(BufferedOutputStream.java:123) at org.apache.commons.httpclient.methods.EntityEnclosingMethod.writeRequestBody(EntityEnclosingMethod.java:506) at org.apache.commons.httpclient.HttpMethodBase.writeRequest(HttpMethodBase.java:2114) at org.apache.commons.httpclient.HttpMethodBase.execute(HttpMethodBase.java:1096) at org.apache.commons.httpclient.HttpMethodDirector.executeWithRetry(HttpMethodDirector.java:398) at org.apache.commons.httpclient.HttpMethodDirector.executeMethod(HttpMethodDirector.java:171) at org.apache.commons.httpclient.HttpClient.executeMethod(HttpClient.java:397) at org.apache.commons.httpclient.HttpClient.executeMethod(HttpClient.java:323) at org.alfresco.repo.search.impl.solr.SolrQueryHTTPClient.executeQuery(SolrQueryHTTPClient.java:318) … 81 more Caused by: sun.security.validator.ValidatorException: PKIX path validation failed: java.security.cert.CertPathValidatorException: timestamp check failed at sun.security.validator.PKIXValidator.doValidate(PKIXValidator.java:289) at sun.security.validator.PKIXValidator.doValidate(PKIXValidator.java:263) at sun.security.validator.PKIXValidator.engineValidate(PKIXValidator.java:173) at sun.security.validator.Validator.validate(Validator.java:218) at com.sun.net.ssl.internal.ssl.X509TrustManagerImpl.validate(X509TrustManagerImpl.java:126) at com.sun.net.ssl.internal.ssl.X509TrustManagerImpl.checkServerTrusted(X509TrustManagerImpl.java:209) at com.sun.net.ssl.internal.ssl.X509TrustManagerImpl.checkServerTrusted(X509TrustManagerImpl.java:249) at com.sun.net.ssl.internal.ssl.ClientHandshaker.serverCertificate(ClientHandshaker.java:1185) … 98 more Caused by: java.security.cert.CertPathValidatorException: timestamp check failed at sun.security.provider.certpath.PKIXMasterCertPathValidator.validate(PKIXMasterCertPathValidator.java:139) at sun.security.provider.certpath.PKIXCertPathValidator.doValidate(PKIXCertPathValidator.java:328) at sun.security.provider.certpath.PKIXCertPathValidator.engineValidate(PKIXCertPathValidator.java:178) at java.security.cert.CertPathValidator.validate(CertPathValidator.java:250) at sun.security.validator.PKIXValidator.doValidate(PKIXValidator.java:275) … 105 more Caused by: java.security.cert.CertificateExpiredException: NotAfter: Fri Aug 17 14:04:11 CEST 2012 at sun.security.x509.CertificateValidity.valid(CertificateValidity.java:256) at sun.security.x509.X509CertImpl.checkValidity(X509CertImpl.java:570) at sun.security.provider.certpath.BasicChecker.verifyTimestamp(BasicChecker.java:157) at sun.security.provider.certpath.BasicChecker.check(BasicChecker.java:109) at sun.security.provider.certpath.PKIXMasterCertPathValidator.validate(PKIXMasterCertPathValidator.java:117) … 109 more 18:27:55,440 ERROR [org.springframework.extensions.webscripts.AbstractRuntime] Exception from executeScript - redirecting to status template error: 08200003 Wrapped Exception (with status template): 08200008 Failed to execute script 'classpath*:alfresco/templates/webscripts/org/alfresco/slingshot/documentlibrary-v2/doclist.get.js': 08200007 Failed to execute search: +PATH:"/cm:generalclassifiable/member" org.springframework.extensions.webscripts.WebScriptException: 08200003 Wrapped Exception (with status template): 08200008 Failed to execute script 'classpath*:alfresco/templates/webscripts/org/alfresco/slingshot/documentlibrary-v2/doclist.get.js': 08200007 Failed to execute search: +PATH:"/cm:generalclassifiable/member" at org.springframework.extensions.webscripts.AbstractWebScript.createStatusException(AbstractWebScript.java:970) at org.springframework.extensions.webscripts.DeclarativeWebScript.execute(DeclarativeWebScript.java:171) at org.alfresco.repo.web.scripts.RepositoryContainer$2.execute(RepositoryContainer.java:393) at org.alfresco.repo.transaction.RetryingTransactionHelper.doInTransaction(RetryingTransactionHelper.java:388) at org.alfresco.repo.web.scripts.RepositoryContainer.transactionedExecute(RepositoryContainer.java:462) at org.alfresco.repo.web.scripts.RepositoryContainer.transactionedExecuteAs(RepositoryContainer.java:500) at org.alfresco.repo.web.scripts.RepositoryContainer.executeScript(RepositoryContainer.java:316) at org.springframework.extensions.webscripts.AbstractRuntime.executeScript(AbstractRuntime.java:372) at org.springframework.extensions.webscripts.AbstractRuntime.executeScript(AbstractRuntime.java:209) at org.springframework.extensions.webscripts.servlet.WebScriptServlet.service(WebScriptServlet.java:118) at javax.servlet.http.HttpServlet.service(HttpServlet.java:717) at org.apache.catalina.core.ApplicationFilterChain.internalDoFilter(ApplicationFilterChain.java:290) at org.apache.catalina.core.ApplicationFilterChain.doFilter(ApplicationFilterChain.java:206) at org.alfresco.web.app.servlet.GlobalLocalizationFilter.doFilter(GlobalLocalizationFilter.java:58) at org.apache.catalina.core.ApplicationFilterChain.internalDoFilter(ApplicationFilterChain.java:235) at org.apache.catalina.core.ApplicationFilterChain.doFilter(ApplicationFilterChain.java:206) at org.apache.catalina.core.StandardWrapperValve.invoke(StandardWrapperValve.java:233) at org.apache.catalina.core.StandardContextValve.invoke(StandardContextValve.java:191) at org.apache.catalina.authenticator.AuthenticatorBase.invoke(AuthenticatorBase.java:470) at org.apache.catalina.core.StandardHostValve.invoke(StandardHostValve.java:127) at org.apache.catalina.valves.ErrorReportValve.invoke(ErrorReportValve.java:102) at org.apache.catalina.core.StandardEngineValve.invoke(StandardEngineValve.java:109) at org.apache.catalina.connector.CoyoteAdapter.service(CoyoteAdapter.java:298) at org.apache.coyote.http11.Http11Processor.process(Http11Processor.java:857) at org.apache.coyote.http11.Http11Protocol$Http11ConnectionHandler.process(Http11Protocol.java:588) at org.apache.tomcat.util.net.JIoEndpoint$Worker.run(JIoEndpoint.java:489) at java.lang.Thread.run(Thread.java:662) Caused by: org.alfresco.scripts.ScriptException: 08200008 Failed to execute script 'classpath*:alfresco/templates/webscripts/org/alfresco/slingshot/documentlibrary-v2/doclist.get.js': 08200007 Failed to execute search: +PATH:"/cm:generalclassifiable/member" at org.alfresco.repo.jscript.RhinoScriptProcessor.execute(RhinoScriptProcessor.java:195) at org.alfresco.repo.processor.ScriptServiceImpl.execute(ScriptServiceImpl.java:212) at org.alfresco.repo.processor.ScriptServiceImpl.executeScript(ScriptServiceImpl.java:174) at org.alfresco.repo.web.scripts.RepositoryScriptProcessor.executeScript(RepositoryScriptProcessor.java:102) at org.springframework.extensions.webscripts.AbstractWebScript.executeScript(AbstractWebScript.java:1193) at org.springframework.extensions.webscripts.DeclarativeWebScript.execute(DeclarativeWebScript.java:86) … 25 more Caused by: org.alfresco.error.AlfrescoRuntimeException: 08200007 Failed to execute search: +PATH:"/cm:generalclassifiable/member" at org.alfresco.repo.jscript.Search.query(Search.java:821) at org.alfresco.repo.jscript.Search.query(Search.java:687) at sun.reflect.NativeMethodAccessorImpl.invoke0(Native Method) at sun.reflect.NativeMethodAccessorImpl.invoke(NativeMethodAccessorImpl.java:39) at sun.reflect.DelegatingMethodAccessorImpl.invoke(DelegatingMethodAccessorImpl.java:25) at java.lang.reflect.Method.invoke(Method.java:597) at org.mozilla.javascript.MemberBox.invoke(MemberBox.java:155) at org.mozilla.javascript.NativeJavaMethod.call(NativeJavaMethod.java:243) at org.mozilla.javascript.optimizer.OptRuntime.call1(OptRuntime.java:66) at org.mozilla.javascript.gen.c4._c15(file:/opt/alfresco-4.0.d/tomcat/webapps/alfresco/WEB-INF/classes/alfresco/templates/webscripts/org/alfresco/slingshot/documentlibrary-v2/doclist.get.js:874) at org.mozilla.javascript.gen.c4.call(file:/opt/alfresco-4.0.d/tomcat/webapps/alfresco/WEB-INF/classes/alfresco/templates/webscripts/org/alfresco/slingshot/documentlibrary-v2/doclist.get.js) at org.mozilla.javascript.optimizer.OptRuntime.callName0(OptRuntime.java:108) at org.mozilla.javascript.gen.c4._c0(file:/opt/alfresco-4.0.d/tomcat/webapps/alfresco/WEB-INF/classes/alfresco/templates/webscripts/org/alfresco/slingshot/documentlibrary-v2/doclist.get.js:1074) at org.mozilla.javascript.gen.c4.call(file:/opt/alfresco-4.0.d/tomcat/webapps/alfresco/WEB-INF/classes/alfresco/templates/webscripts/org/alfresco/slingshot/documentlibrary-v2/doclist.get.js) at org.mozilla.javascript.ContextFactory.doTopCall(ContextFactory.java:393) at org.mozilla.javascript.ScriptRuntime.doTopCall(ScriptRuntime.java:2834) at org.mozilla.javascript.gen.c4.call(file:/opt/alfresco-4.0.d/tomcat/webapps/alfresco/WEB-INF/classes/alfresco/templates/webscripts/org/alfresco/slingshot/documentlibrary-v2/doclist.get.js) at org.mozilla.javascript.gen.c4.exec(file:/opt/alfresco-4.0.d/tomcat/webapps/alfresco/WEB-INF/classes/alfresco/templates/webscripts/org/alfresco/slingshot/documentlibrary-v2/doclist.get.js) at org.alfresco.repo.jscript.RhinoScriptProcessor.executeScriptImpl(RhinoScriptProcessor.java:483) at org.alfresco.repo.jscript.RhinoScriptProcessor.execute(RhinoScriptProcessor.java:191) … 30 more Caused by: org.alfresco.repo.search.impl.lucene.LuceneQueryParserException: 08200006 at org.alfresco.repo.search.impl.solr.SolrQueryHTTPClient.executeQuery(SolrQueryHTTPClient.java:364) at org.alfresco.repo.search.impl.solr.SolrQueryLanguage.executeQuery(SolrQueryLanguage.java:49) at org.alfresco.repo.search.impl.solr.SolrSearchService.query(SolrSearchService.java:348) at org.alfresco.repo.search.SearcherComponent.query(SearcherComponent.java:78) at sun.reflect.NativeMethodAccessorImpl.invoke0(Native Method) at sun.reflect.NativeMethodAccessorImpl.invoke(NativeMethodAccessorImpl.java:39) at sun.reflect.DelegatingMethodAccessorImpl.invoke(DelegatingMethodAccessorImpl.java:25) at java.lang.reflect.Method.invoke(Method.java:597) at org.alfresco.repo.management.subsystems.SubsystemProxyFactory$1.invoke(SubsystemProxyFactory.java:65) at org.springframework.aop.framework.ReflectiveMethodInvocation.proceed(ReflectiveMethodInvocation.java:172) at org.springframework.aop.framework.JdkDynamicAopProxy.invoke(JdkDynamicAopProxy.java:202) at $Proxy13.query(Unknown Source) at sun.reflect.NativeMethodAccessorImpl.invoke0(Native Method) at sun.reflect.NativeMethodAccessorImpl.invoke(NativeMethodAccessorImpl.java:39) at sun.reflect.DelegatingMethodAccessorImpl.invoke(DelegatingMethodAccessorImpl.java:25) at java.lang.reflect.Method.invoke(Method.java:597) at org.springframework.aop.support.AopUtils.invokeJoinpointUsingReflection(AopUtils.java:309) at org.springframework.aop.framework.ReflectiveMethodInvocation.invokeJoinpoint(ReflectiveMethodInvocation.java:183) at org.springframework.aop.framework.ReflectiveMethodInvocation.proceed(ReflectiveMethodInvocation.java:150) at net.sf.acegisecurity.intercept.method.aopalliance.MethodSecurityInterceptor.invoke(MethodSecurityInterceptor.java:80) at org.springframework.aop.framework.ReflectiveMethodInvocation.proceed(ReflectiveMethodInvocation.java:172) at org.alfresco.repo.security.permissions.impl.ExceptionTranslatorMethodInterceptor.invoke(ExceptionTranslatorMethodInterceptor.java:46) at org.springframework.aop.framework.ReflectiveMethodInvocation.proceed(ReflectiveMethodInvocation.java:172) at org.alfresco.repo.audit.AuditMethodInterceptor.invoke(AuditMethodInterceptor.java:147) at org.springframework.aop.framework.ReflectiveMethodInvocation.proceed(ReflectiveMethodInvocation.java:172) at org.springframework.transaction.interceptor.TransactionInterceptor.invoke(TransactionInterceptor.java:110) at org.springframework.aop.framework.ReflectiveMethodInvocation.proceed(ReflectiveMethodInvocation.java:172) at org.springframework.aop.framework.JdkDynamicAopProxy.invoke(JdkDynamicAopProxy.java:202) at $Proxy13.query(Unknown Source) at org.alfresco.repo.jscript.Search.query(Search.java:801) … 49 more Caused by: javax.net.ssl.SSLHandshakeException: sun.security.validator.ValidatorException: PKIX path validation failed: java.security.cert.CertPathValidatorException: timestamp check failed at com.sun.net.ssl.internal.ssl.Alerts.getSSLException(Alerts.java:174) at com.sun.net.ssl.internal.ssl.SSLSocketImpl.fatal(SSLSocketImpl.java:1649) at com.sun.net.ssl.internal.ssl.Handshaker.fatalSE(Handshaker.java:241) at com.sun.net.ssl.internal.ssl.Handshaker.fatalSE(Handshaker.java:235) at com.sun.net.ssl.internal.ssl.ClientHandshaker.serverCertificate(ClientHandshaker.java:1206) at com.sun.net.ssl.internal.ssl.ClientHandshaker.processMessage(ClientHandshaker.java:136) at com.sun.net.ssl.internal.ssl.Handshaker.processLoop(Handshaker.java:593) at com.sun.net.ssl.internal.ssl.Handshaker.process_record(Handshaker.java:529) at com.sun.net.ssl.internal.ssl.SSLSocketImpl.readRecord(SSLSocketImpl.java:893) at com.sun.net.ssl.internal.ssl.SSLSocketImpl.performInitialHandshake(SSLSocketImpl.java:1138) at com.sun.net.ssl.internal.ssl.SSLSocketImpl.writeRecord(SSLSocketImpl.java:632) at com.sun.net.ssl.internal.ssl.AppOutputStream.write(AppOutputStream.java:59) at java.io.BufferedOutputStream.flushBuffer(BufferedOutputStream.java:65) at java.io.BufferedOutputStream.flush(BufferedOutputStream.java:123) at org.apache.commons.httpclient.methods.EntityEnclosingMethod.writeRequestBody(EntityEnclosingMethod.java:506) at org.apache.commons.httpclient.HttpMethodBase.writeRequest(HttpMethodBase.java:2114) at org.apache.commons.httpclient.HttpMethodBase.execute(HttpMethodBase.java:1096) at org.apache.commons.httpclient.HttpMethodDirector.executeWithRetry(HttpMethodDirector.java:398) at org.apache.commons.httpclient.HttpMethodDirector.executeMethod(HttpMethodDirector.java:171) at org.apache.commons.httpclient.HttpClient.executeMethod(HttpClient.java:397) at org.apache.commons.httpclient.HttpClient.executeMethod(HttpClient.java:323) at org.alfresco.repo.search.impl.solr.SolrQueryHTTPClient.executeQuery(SolrQueryHTTPClient.java:318) … 78 more Caused by: sun.security.validator.ValidatorException: PKIX path validation failed: java.security.cert.CertPathValidatorException: timestamp check failed at sun.security.validator.PKIXValidator.doValidate(PKIXValidator.java:289) at sun.security.validator.PKIXValidator.doValidate(PKIXValidator.java:263) at sun.security.validator.PKIXValidator.engineValidate(PKIXValidator.java:173) at sun.security.validator.Validator.validate(Validator.java:218) at com.sun.net.ssl.internal.ssl.X509TrustManagerImpl.validate(X509TrustManagerImpl.java:126) at com.sun.net.ssl.internal.ssl.X509TrustManagerImpl.checkServerTrusted(X509TrustManagerImpl.java:209) at com.sun.net.ssl.internal.ssl.X509TrustManagerImpl.checkServerTrusted(X509TrustManagerImpl.java:249) at com.sun.net.ssl.internal.ssl.ClientHandshaker.serverCertificate(ClientHandshaker.java:1185) … 95 more Caused by: java.security.cert.CertPathValidatorException: timestamp check failed at sun.security.provider.certpath.PKIXMasterCertPathValidator.validate(PKIXMasterCertPathValidator.java:139) at sun.security.provider.certpath.PKIXCertPathValidator.doValidate(PKIXCertPathValidator.java:328) at sun.security.provider.certpath.PKIXCertPathValidator.engineValidate(PKIXCertPathValidator.java:178) at java.security.cert.CertPathValidator.validate(CertPathValidator.java:250) at sun.security.validator.PKIXValidator.doValidate(PKIXValidator.java:275) … 102 more Caused by: java.security.cert.CertificateExpiredException: NotAfter: Fri Aug 17 14:04:11 CEST 2012 at sun.security.x509.CertificateValidity.valid(CertificateValidity.java:256) at sun.security.x509.X509CertImpl.checkValidity(X509CertImpl.java:570) at sun.security.provider.certpath.BasicChecker.verifyTimestamp(BasicChecker.java:157) at sun.security.provider.certpath.BasicChecker.check(BasicChecker.java:109) at sun.security.provider.certpath.PKIXMasterCertPathValidator.validate(PKIXMasterCertPathValidator.java:117) … 106 more 18:28:00,268 INFO [org.alfresco.util.OpenOfficeConnectionTester] The OpenOffice connection was re-established.
Caused by: java.security.cert.CertificateExpiredException: NotAfter: Fri Aug 17 14:04:11 CEST 2012