As we transition to the new Hyland Community, some post links may be temporarily disrupted as we finalize redirects. We apologize for the inconvenience and are working to resolve this as quickly as possible. Details.
C:\Projects\open_src\activiti-5.11_src\modules\activiti-engine>mvn install[INFO] Scanning for projects……Results :Failed tests: testQueryDateVariable(org.activiti.engine.test.api.runtime.ExecutionQueryTest) testQueryDateVariable(org.activiti.engine.test.api.runtime.ProcessInstanceQueryTest) testCompetingJobAcquisitions(org.activiti.engine.test.concurrency.CompetingJobAcquisitionTest)Tests run: 1041, Failures: 3, Errors: 0, Skipped: 0…
C:\Projects\open_src\activiti-5.11_src\modules\activiti-engine>mvn clean install[INFO] Scanning for projects…Results :Failed tests: testQueryDateVariable(org.activiti.engine.test.api.runtime.ProcessInstanceQueryTest)Tests run: 1041, Failures: 1, Errors: 0, Skipped: 0…
C:\Projects\open_src\activiti-5.11_src\modules\activiti-engine>mvn clean install[INFO] Scanning for projects……Running org.activiti.engine.test.bpmn.event.timer.StartTimerEventTest[INFO] ————————————————————————[INFO] BUILD FAILURE[INFO] ————————————————————————…Strangely, as you can see, there was no results summary. The failed test is org.activiti.engine.test.api.runtime.ExecutionQueryTest
C:\Projects\open_src\activiti-5.11_src\modules\activiti-engine>mvn clean install[INFO] Scanning for projects……Results :Tests run: 1041, Failures: 0, Errors: 0, Skipped: 0Hooray, success!
C:\Projects\open_src\activiti-5.11_src\modules\activiti-engine>mvn clean install[INFO] Scanning for projects……Results :Failed tests: testQueryDateVariable(org.activiti.engine.test.api.runtime.ExecutionQueryTest) testCompetingJobAcquisitions(org.activiti.engine.test.concurrency.CompetingJobAcquisitionTest)Tests run: 1041, Failures: 2, Errors: 0, Skipped: 0…
——————————————————————————-Test set: org.activiti.engine.test.api.runtime.ExecutionQueryTest——————————————————————————-Tests run: 30, Failures: 1, Errors: 0, Skipped: 0, Time elapsed: 7.922 sec <<< FAILURE!testQueryDateVariable(org.activiti.engine.test.api.runtime.ExecutionQueryTest) Time elapsed: 0.328 sec <<< FAILURE!junit.framework.AssertionFailedError: expected:<2> but was:<3> at junit.framework.Assert.fail(Assert.java:47) at junit.framework.Assert.failNotEquals(Assert.java:283) at junit.framework.Assert.assertEquals(Assert.java:64) at junit.framework.Assert.assertEquals(Assert.java:195) at junit.framework.Assert.assertEquals(Assert.java:201) at org.activiti.engine.test.api.runtime.ExecutionQueryTest.testQueryDateVariable(ExecutionQueryTest.java:830)
——————————————————————————-Test set: org.activiti.engine.test.api.runtime.ProcessInstanceQueryTest——————————————————————————-Tests run: 37, Failures: 1, Errors: 0, Skipped: 0, Time elapsed: 7.61 sec <<< FAILURE!testQueryDateVariable(org.activiti.engine.test.api.runtime.ProcessInstanceQueryTest) Time elapsed: 0.25 sec <<< FAILURE!junit.framework.AssertionFailedError: expected:<2> but was:<3> at junit.framework.Assert.fail(Assert.java:47) at junit.framework.Assert.failNotEquals(Assert.java:283) at junit.framework.Assert.assertEquals(Assert.java:64) at junit.framework.Assert.assertEquals(Assert.java:195) at junit.framework.Assert.assertEquals(Assert.java:201) at org.activiti.engine.test.api.runtime.ProcessInstanceQueryTest.testQueryDateVariable(ProcessInstanceQueryTest.java:812)
——————————————————————————-Test set: org.activiti.engine.test.concurrency.CompetingJobAcquisitionTest——————————————————————————-Tests run: 1, Failures: 1, Errors: 0, Skipped: 0, Time elapsed: 0.062 sec <<< FAILURE!testCompetingJobAcquisitions(org.activiti.engine.test.concurrency.CompetingJobAcquisitionTest) Time elapsed: 0.062 sec <<< FAILURE!junit.framework.AssertionFailedError: null at junit.framework.Assert.fail(Assert.java:47) at junit.framework.Assert.assertTrue(Assert.java:20) at junit.framework.Assert.assertNotNull(Assert.java:214) at junit.framework.Assert.assertNotNull(Assert.java:207) at org.activiti.engine.test.concurrency.CompetingJobAcquisitionTest.testCompetingJobAcquisitions(CompetingJobAcquisitionTest.java:75)
739 Date date1 = Calendar.getInstance().getTime();<br>740 vars.put("dateVar", date1);<br>741 <br>742 ProcessInstance processInstance1 = runtimeService.startProcessInstanceByKey("oneTaskProcess", vars);<br>743 <br>744 Date date2 = Calendar.getInstance().getTime();<br>
744 Date date2 = Calendar.getInstance().getTime();745 date2.setTime( date2.getTime() + 1000 ); //Add one second to explicitly distinguish from 'date1'